{"text_format":"3","workbook":"xlsx","n_sheets":3,"sheets":["Инструкция","Калькулятор","Коэффициенты повторяемости"],"not_rendered":{"images":6,"macros":1,"defined_names":20,"comments":2},"read":"whole","date_system":"1900"}

{"sheet":"Инструкция","index":0,"n_rows":27,"n_cols":3,"rows_kept":27,"merged":[[1,2,1,9],[2,2,2,9],[4,2,4,9],[5,2,5,9],[6,2,6,9],[8,2,8,9],[9,2,9,9],[11,2,11,9],[12,2,12,9],[13,2,13,9],[14,2,14,9],[15,2,15,9],[16,2,16,9],[18,2,18,9],[19,2,19,9],[20,2,20,9],[21,2,21,9],[23,2,23,9],[24,2,24,9],[25,2,25,9],[26,2,26,9]]}
[]
[null,null,"Подготовлено редакцией АПС «Бизнес-Инфо» (ООО «Профессиональные правовые системы»)"]
[null,null,"Инструкция по работе\nс Калькулятором норм труда на уборку производственных помещений"]
[]
[null,null,"1. Калькулятор позволяет рассчитать нормы труда:"]
[null,null," - для конкретного уборщика;"]
[null,null," - на уборку помещения."]
[]
[null,null,"2. Укажите продолжительность рабочей смены и наименование помещения или Ф.И.О. уборщика."]
[]
[]
[null,null,"3. Выберите  из выпадающих списков группы помещений, в которых производится уборка."]
[]
[null,null,"При выборе группы автоматически открываются формы расчетов, количество которых равно количеству видов работ и способов уборки производственного помещения для данной группы."]
[]
[null,null,"Для скрытия форм группы нажмите кнопку «Скрыть раздел»."]
[]
[]
[null,null,"4. В разделе «Уборка стен, панелей, колонн» для открытия форм расчетов нажмите соответствующие кнопки."]
[]
[null,null,"5. При расчете нормы труда для уборщика обращайте внимание на сообщение, которое может появиться, если суммарная нормативная трудоемкость работ окажется больше указанной продолжительности рабочей смены."]
[]
[]
[null,null,"6. При расчете норм труда на уборку помещения на основании нормативной трудоемкости обслуживания может быть рассчитана численность уборщиков с учетом установленного фонда рабочего времени и коэффициента сменности."]
[]
[null,null,"Справочно"]
[null,null,"Калькулятор разработан на основании постановления Министерства труда и социальной защиты Республики Беларусь от 30.06.2003 № 79 «О нормах труда на уборку производственных помещений»."]

{"sheet":"Калькулятор","index":1,"n_rows":515,"n_cols":34,"rows_kept":515,"merged":[[2,2,2,11],[2,13,2,16],[4,2,4,6],[4,13,6,16],[4,17,6,17],[6,2,6,11],[8,2,8,5],[8,9,16,11],[8,13,11,17],[10,2,10,5],[12,2,12,5],[14,2,14,5],[16,2,16,5],[18,2,18,11],[20,2,20,5],[20,6,20,11],[22,2,22,5],[24,2,24,6],[26,2,26,4],[26,6,26,10],[28,2,28,4],[30,2,30,7],[32,2,32,6],[32,8,32,11],[34,2,34,5],[34,6,34,11],[36,2,36,5],[38,2,38,6],[40,2,40,4],[40,6,40,10],[42,2,42,4],[44,2,44,7],[46,2,46,6],[46,8,46,11],[48,2,48,5],[48,6,48,11],[50,2,50,5],[52,2,52,6],[54,2,54,4],[54,6,54,10],[56,2,56,4],[58,2,58,7],[60,2,60,6],[60,8,60,11],[62,2,62,11],[64,2,64,4],[70,2,70,5],[70,6,70,11],[72,2,72,6],[74,2,74,4],[76,2,76,5],[78,2,78,5],[80,2,80,7],[82,2,82,6],[82,8,82,11],[84,2,84,4],[92,2,92,5],[92,6,92,11],[94,2,94,6],[96,2,96,4],[98,2,98,5],[100,2,100,5],[102,2,102,7],[104,2,104,6],[104,8,104,11],[108,2,108,6],[108,7,108,11],[110,2,110,6],[112,2,112,4],[114,2,114,5],[116,2,116,5],[118,2,118,7],[120,2,120,6],[122,2,122,11],[124,2,124,5],[124,6,124,11],[126,2,126,9],[128,2,128,6],[130,2,130,4],[130,6,130,10],[132,2,132,4],[134,2,134,5],[136,2,136,7],[138,2,138,6],[138,8,138,11],[140,2,140,5],[140,6,140,11],[142,2,142,9],[144,2,144,6],[146,2,146,4],[146,6,146,10],[148,2,148,4],[150,2,150,5],[152,2,152,7],[154,2,154,6],[154,8,154,11],[156,2,156,5],[156,6,156,11],[158,2,158,9],[160,2,160,6],[162,2,162,4],[162,6,162,10],[164,2,164,4],[166,2,166,5],[168,2,168,7],[170,2,170,6],[170,8,170,11],[172,2,172,5],[172,6,172,11],[174,2,174,9],[176,2,176,6],[178,2,178,4],[178,6,178,10],[180,2,180,4],[182,2,182,5],[184,2,184,7],[186,2,186,6],[186,8,186,11],[188,2,188,5],[188,6,188,11],[190,2,190,9],[192,2,192,6],[194,2,194,4],[194,6,194,10],[196,2,196,4],[198,2,198,5],[200,2,200,7],[202,2,202,6],[202,8,202,11],[204,2,204,11],[206,2,206,5],[206,6,206,11],[208,2,208,9],[210,2,210,6],[212,2,212,4],[212,6,212,10],[214,2,214,4],[216,2,216,5],[218,2,218,7],[220,2,220,6],[220,8,220,11],[222,2,222,5],[222,6,222,11],[224,2,224,9],[226,2,226,6],[228,2,228,4],[228,6,228,10],[230,2,230,4],[232,2,232,5],[234,2,234,7],[236,2,236,6],[236,8,236,11],[238,2,238,5],[238,6,238,11],[240,2,240,9],[242,2,242,6],[244,2,244,4],[244,6,244,10],[246,2,246,4],[248,2,248,5],[250,2,250,7],[252,2,252,6],[252,8,252,11],[254,2,254,5],[254,6,254,11],[256,2,256,9],[258,2,258,6],[260,2,260,4],[260,6,260,10],[262,2,262,4],[264,2,264,5],[266,2,266,7],[268,2,268,6],[268,8,268,11],[270,2,270,5],[270,6,270,11],[272,2,272,9],[274,2,274,6],[276,2,276,4],[276,6,276,10],[278,2,278,4],[280,2,280,5],[282,2,282,7],[284,2,284,6],[284,8,284,11],[286,2,286,5],[286,6,286,11],[288,2,288,9],[290,2,290,6],[292,2,292,4],[292,6,292,10],[294,2,294,4],[296,2,296,5],[298,2,298,7],[300,2,300,6],[300,8,300,11],[302,2,302,5],[302,6,302,11],[304,2,304,9],[306,2,306,6],[308,2,308,4],[308,6,308,10],[310,2,310,4],[312,2,312,5],[314,2,314,7],[316,2,316,6],[316,8,316,11],[318,2,318,5],[318,6,318,11],[320,2,320,9],[322,2,322,6],[324,2,324,4],[324,6,324,10],[326,2,326,4],[328,2,328,5],[330,2,330,7],[332,2,332,6],[332,8,332,11],[334,2,334,11],[336,2,336,5],[336,6,336,11],[338,2,338,9],[340,2,340,6],[342,2,342,4],[342,6,342,10],[344,2,344,4],[346,2,346,5],[350,2,350,10],[352,2,352,7],[354,2,354,6],[354,8,354,11],[356,2,356,5],[356,6,356,11],[358,2,358,9],[360,2,360,6],[362,2,362,4],[362,6,362,10],[366,2,366,5],[370,2,370,10],[372,2,372,7],[374,2,374,6],[374,8,374,11],[376,2,376,5],[376,6,376,11],[378,2,378,9],[380,2,380,6],[382,2,382,4],[382,6,382,10],[386,2,386,5],[390,2,390,10],[392,2,392,7],[394,2,394,6],[394,8,394,11],[396,2,396,11],[398,2,398,5],[398,6,398,11],[400,2,400,9],[402,2,402,6],[404,2,404,4],[404,6,404,10],[408,2,408,5],[410,2,410,10],[412,2,412,7],[414,2,414,6],[414,8,414,11],[416,2,416,5],[416,6,416,11],[418,2,418,9],[420,2,420,6],[422,2,422,4],[422,6,422,10],[426,2,426,5],[428,2,428,10],[430,2,430,7],[432,2,432,6],[432,8,432,11],[434,2,434,11],[436,2,436,5],[438,2,438,5],[438,6,438,11],[440,2,440,6],[442,2,442,4],[442,6,442,10],[446,2,446,5],[448,2,448,7],[450,2,450,6],[452,2,452,5],[454,2,454,5],[454,6,454,11],[456,2,456,6],[458,2,458,4],[458,6,458,10],[462,2,462,5],[464,2,464,7],[466,2,466,6],[468,2,468,5],[470,2,470,5],[470,6,470,11],[472,2,472,6],[474,2,474,4],[474,6,474,10],[478,2,478,5],[480,2,480,7],[482,2,482,6],[484,2,484,5],[486,2,486,5],[486,6,486,11],[488,2,488,6],[490,2,490,4],[490,6,490,10],[494,2,494,5],[496,2,496,7],[498,2,498,6],[500,2,500,5],[502,2,502,5],[502,6,502,11],[504,2,504,6],[506,2,506,4],[506,6,506,10],[510,2,510,5],[512,2,512,7],[514,2,514,6]]}
[" "]
[]
[null,null,"Калькулятор норм труда на уборку производственных помещений",{"$nulls":10},"Итого нормативная трудоемкость обслуживания, чел.-ч",{"$nulls":3},{"$f":"I31+I45+I59+I81+I103+I119+I137+I153+I169+I185+I201+I219+I235+I251+I267+I283+I299+I315+I331+I353+I373+I393+I413+I431+I449+I465+I481+I497+I513","v":{"v":0,"d":"0.00"}}]
[]
[null,null,"Продолжительность рабочей смены, ч",{"$nulls":10},"Итого нормативная обслуживаемая площадь, м2",{"$nulls":3},{"$f":"H33+H47+H61+H83+H105+H121+H139+H155+H171+H187+H203+H221+H237+H253+H269+H285+H301+H317+H333+H355+H375+H395+H415+H433+H451+H467+H483+H499+H515","v":{"v":0,"d":"0.0"}}]
[{"$nulls":19},{"$f":"CONCATENATE($G$9,$G$21)","v":""},1,1,"Подметание пола без предварительного увлажнения",{"$f":"CONCATENATE(V6,W6)","v":"1Подметание пола без предварительного увлажнения"},0.37,null,2160,null,null,"Подметание пола без предварительного увлажнения"]
[{"$nulls":19},{"$f":"CONCATENATE($G$9,$G$35)","v":""},2,1,"Подметание пола с предварительным увлажнением",{"$f":"CONCATENATE(V7,W7)","v":"1Подметание пола с предварительным увлажнением"},{"v":0.4,"d":"0.40"},null,2000,null,null,"Подметание пола с предварительным увлажнением"]
[{"$nulls":19},{"$f":"CONCATENATE($G$9,$G$49)","v":""},3,1,"Мытье пола с применением моющих средств","1Мытье пола с применением моющих средств",1.12,null,715,null,null,"Мытье пола с применением моющих средств"]
[null,null,"Группа производственного помещения",{"$nulls":6},{"$f":"IF(OR(AND(G9=1,G11=1),AND(G9=1,G13=1),AND(G9=1,G15=1),AND(G9=1,G17=1)),\"Один и тот же номер группы может быть указан один раз\",\nIF(OR(AND(G9=2,G11=2),AND(G9=2,G13=2),AND(G9=2,G15=2),AND(G9=2,G17=2)),\"Один и тот же номер группы может быть указан один раз\",\nIF(OR(AND(G9=3,G11=3),AND(G9=3,G13=3),AND(G9=3,G15=3),AND(G9=3,G17=3)),\"Один и тот же номер группы может быть указан один раз\",\nIF(OR(AND(G9=4,G11=4),AND(G9=4,G13=4),AND(G9=4,G15=4),AND(G9=4,G17=4)),\"Один и тот же номер группы может быть указан один раз\",\nIF(OR(AND(G9=5,G11=5),AND(G9=5,G13=5),AND(G9=5,G15=5),AND(G9=5,G17=5)),\"Номер группы может быть указан один раз\",\"\")\n\n))))","v":""},{"$nulls":3},{"$f":"IF(H5=\"\",\"\",IF(R3>H5,\"Нормативная трудоемкость обслуживания превышает продолжительность рабочей смены!\"))","v":""},{"$nulls":5},{"$f":"CONCATENATE($G$9,$G$71)","v":""},4,1,"Мытье и уборка женского туалета","1Мытье и уборка женского туалета",4.57,null,175]
[{"$nulls":19},{"$f":"CONCATENATE($G$9,$G$93)","v":""},5,1,"Мытье и уборка мужского туалета","1Мытье и уборка мужского туалета",5.33,null,150,null,null,"Мытье и уборка женского туалета"]
[null,null,"Группа производственного помещения",{"$nulls":16},{"$f":"CONCATENATE($G$9,$H$109)","v":""},null,1,"Мытье и уборка душевой комнаты","1Мытье и уборка душевой комнаты",2.86,null,280,null,null,"Мытье и уборка мужского туалета"]
[{"$nulls":19},{"$f":"CONCATENATE($G$11,$G$21)","v":""},null,2,"Подметание пола без предварительного увлажнения",{"$f":"CONCATENATE(V12,W12)","v":"2Подметание пола без предварительного увлажнения"},0.37,null,2160,null,null,"Мытье и уборка душевой комнаты"]
[null,null,"Группа производственного помещения",{"$nulls":16},{"$f":"CONCATENATE($G$11,$G$35)","v":""},null,2,"Подметание пола с предварительным увлажнением",{"$f":"CONCATENATE(V13,W13)","v":"2Подметание пола с предварительным увлажнением"},{"v":0.4,"d":"0.40"},null,2000]
[{"$nulls":19},{"$f":"CONCATENATE($G$11,$G$49)","v":""},null,2,"Мытье пола с применением моющих средств","2Мытье пола с применением моющих средств",1.12,null,715,null,null,1,2,3,4,5]
[null,null,"Группа производственного помещения",{"$nulls":16},{"$f":"CONCATENATE($G$11,$G$71)","v":""},null,2,"Мытье и уборка женского туалета","2Мытье и уборка женского туалета",4.57,null,175]
[{"$nulls":19},{"$f":"CONCATENATE($G$11,$G$93)","v":""},null,2,"Мытье и уборка мужского туалета","2Мытье и уборка мужского туалета",5.33,null,150]
[null,null,"Группа производственного помещения",{"$nulls":16},{"$f":"CONCATENATE($G$11,$H$109)","v":""},null,2,"Мытье и уборка душевой комнаты","2Мытье и уборка душевой комнаты",2.86,null,280]
[{"$nulls":19},{"$f":"CONCATENATE($G$13,$G$21)","v":""},null,3,"Подметание пола без предварительного увлажнения",{"$f":"CONCATENATE(V18,W18)","v":"3Подметание пола без предварительного увлажнения"},0.37,null,2160]
[null,null,"Уборка помещений на производствах, не имеющих отходов (1-я группа)",{"$nulls":16},{"$f":"CONCATENATE($G$13,$G$35)","v":""},null,3,"Подметание пола с предварительным увлажнением",{"$f":"CONCATENATE(V19,W19)","v":"3Подметание пола с предварительным увлажнением"},{"v":0.4,"d":"0.40"},null,2000]
[{"$nulls":19},{"$f":"CONCATENATE($G$13,$G$49)","v":""},null,3,"Мытье пола с применением моющих средств","3Мытье пола с применением моющих средств",1.12,null,715]
[null,null,"Вид работ и способ уборки производственного помещения",{"$nulls":16},{"$f":"CONCATENATE($G$13,$G$71)","v":""},null,3,"Мытье и уборка женского туалета","3Мытье и уборка женского туалета",4.57,null,175]
[{"$nulls":19},{"$f":"CONCATENATE($G$13,$G$93)","v":""},null,3,"Мытье и уборка мужского туалета","3Мытье и уборка мужского туалета",5.33,null,150]
[null,null,"Повторяемость уборки за смену",{"$nulls":16},{"$f":"CONCATENATE($G$13,$H$109)","v":""},null,3,"Мытье и уборка душевой комнаты","3Мытье и уборка душевой комнаты",2.86,null,280]
[{"$nulls":19},{"$f":"CONCATENATE($G$15,$G$21)","v":""},null,4,"Подметание пола без предварительного увлажнения",{"$f":"CONCATENATE(V24,W24)","v":"4Подметание пола без предварительного увлажнения"},0.37,null,2160]
[null,null,"Норма времени обслуживания 100 м2, чел.-ч",{"$nulls":4},{"$f":"IFERROR(VLOOKUP($T$6,$X$6:$AA$11,2,FALSE),0)","v":{"v":0,"d":"0.00"}},{"$nulls":11},{"$f":"CONCATENATE($G$15,$G$35)","v":""},null,4,"Подметание пола с предварительным увлажнением",{"$f":"CONCATENATE(V25,W25)","v":"4Подметание пола с предварительным увлажнением"},{"v":0.4,"d":"0.40"},null,2000,null,null,"норма времени обслуживания"]
[{"$nulls":19},{"$f":"CONCATENATE($G$15,$G$49)","v":""},null,4,"Мытье пола с применением моющих средств","4Мытье пола с применением моющих средств",1.12,null,715]
[null,null,"Норма обслуживания, м2",null,null,{"$f":"IFERROR(VLOOKUP($T$6,$X$6:$AA$11,4,FALSE),0)","v":{"v":0,"d":"0.00"}},"Ширина проходов между оборудованием, м",{"$nulls":12},{"$f":"CONCATENATE($G$15,$G$71)","v":""},null,4,"Мытье и уборка женского туалета","4Мытье и уборка женского туалета",4.57,null,175,null,null,"норма обслуживания"]
[{"$nulls":19},{"$f":"CONCATENATE($G$15,$G$93)","v":""},null,4,"Мытье и уборка мужского туалета","4Мытье и уборка мужского туалета",5.33,null,150]
[null,null,"Площадь помещения, м2",{"$nulls":16},{"$f":"CONCATENATE($G$15,$H$109)","v":""},null,4,"Мытье и уборка душевой комнаты","4Мытье и уборка душевой комнаты",2.86,null,280]
[{"$nulls":19},{"$f":"CONCATENATE($G$17,$G$21)","v":""},null,5,"Подметание пола без предварительного увлажнения",{"$f":"CONCATENATE(V30,W30)","v":"5Подметание пола без предварительного увлажнения"},0.37,null,2160]
[null,null,"Нормативная трудоемкость обслуживания, чел.-ч",{"$nulls":5},{"$f":"IF($G$23=\"\",$F$29/100*$H$25,$F$29/100*$H$25*IFERROR(VLOOKUP('Коэффициенты повторяемости'!$K$3,'Коэффициенты повторяемости'!$O$3:$P$102,2,FALSE),0))","v":{"v":0,"d":"0.00"}},{"$nulls":10},{"$f":"CONCATENATE($G$17,$G$35)","v":""},null,5,"Подметание пола с предварительным увлажнением",{"$f":"CONCATENATE(V31,W31)","v":"5Подметание пола с предварительным увлажнением"},{"v":0.4,"d":"0.40"},null,2000]
[{"$nulls":19},{"$f":"CONCATENATE($G$17,$G$49)","v":""},null,5,"Мытье пола с применением моющих средств","5Мытье пола с применением моющих средств",1.12,null,715]
[null,null,"Нормативная обслуживаемая площадь, м2",{"$nulls":4},{"$f":"IF($L$27=\"\",0,IF($L$27<1,IF($G$23=\"\",$F$27,$F$27*IFERROR(VLOOKUP('Коэффициенты повторяемости'!$K$4,'Коэффициенты повторяемости'!$O$3:$P$102,2,FALSE),0))*0.85,IF(L27>=1,IF(G23=\"\",F27,F27*IFERROR(VLOOKUP('Коэффициенты повторяемости'!$K$4,'Коэффициенты повторяемости'!$O$3:$P$102,2,FALSE),0)))))","v":{"v":0,"d":"0.0"}},{"$f":"IF(L27=\"\",\"Укажите ширину прохода между оборудованием\",\"\")","v":"Укажите ширину прохода между оборудованием"},{"$nulls":10},{"$f":"CONCATENATE($G$17,$G$71)","v":""},null,5,"Мытье и уборка женского туалета","5Мытье и уборка женского туалета",4.57,null,175]
[{"$nulls":19},{"$f":"CONCATENATE($G$17,$G$93)","v":""},null,5,"Мытье и уборка мужского туалета","5Мытье и уборка мужского туалета",5.33,null,150]
[null,null,"Вид работ и способ уборки производственного помещения",{"$nulls":16},{"$f":"CONCATENATE($G$17,$H$109)","v":""},null,5,"Мытье и уборка душевой комнаты","5Мытье и уборка душевой комнаты",2.86,null,280]
[]
[null,null,"Повторяемость уборки за смену"]
[]
[null,null,"Норма времени обслуживания 100 м2, чел.-ч",{"$nulls":4},{"$f":"IFERROR(VLOOKUP($T$7,$X$6:$AA$11,2,FALSE),0)","v":{"v":0,"d":"0.00"}},{"$nulls":21},"норма времени обслуживания"]
[]
{"$rows_left_out":476}
{"sheet":"Коэффициенты повторяемости","index":2,"n_rows":102,"n_cols":18,"rows_kept":102,"hidden":true,"merged":[[2,2,2,8],[4,2,7,2],[4,3,4,8],[5,3,5,4],[5,5,5,6],[5,7,5,8],[6,3,6,8]]}
[]
[]
[null,null,"Поправочные коэффициенты для пересчета норм при различной повторяемости ",{"$nulls":7},{"$f":"CONCATENATE(Калькулятор!$G$9,Калькулятор!$AD$25,Калькулятор!$G$23)","v":"норма времени обслуживания"},1,"норма обслуживания",1.2,{"$f":"CONCATENATE(L3,M3,N3)","v":"1норма обслуживания1,2"},0.83,null,1.2]
[{"$nulls":10},{"$f":"CONCATENATE(Калькулятор!$G$9,Калькулятор!$AD$27,Калькулятор!$G$23)","v":"норма обслуживания"},1,"норма времени обслуживания",1.2,{"$f":"CONCATENATE(L4,M4,N4)","v":"1норма времени обслуживания1,2"},{"v":1.2,"d":"1.20"},null,1.4]
[null,null,"Повторя-емость уборки за смену","Группа производственных помещений",{"$nulls":6},{"$f":"CONCATENATE(Калькулятор!$G$9,Калькулятор!$AD$39,Калькулятор!$G$37)","v":"норма времени обслуживания"},2,"норма обслуживания",1.2,"2норма обслуживания1,2",0.86,null,1.6]
[{"$nulls":3},"1-я",null,"2-я, 3-я",null,"4-я, 5-я",null,null,{"$f":"CONCATENATE(Калькулятор!$G$9,Калькулятор!$AD$41,Калькулятор!$G$37)","v":"норма обслуживания"},2,"норма времени обслуживания",1.2,"2норма времени обслуживания1,2",1.16,null,1.8]
[{"$nulls":3},"поправочные коэффициенты к:",{"$nulls":6},{"$f":"CONCATENATE(Калькулятор!$G$9,Калькулятор!$AD$59,Калькулятор!$G$51)","v":"норма времени обслуживания"},3,"норма обслуживания",1.2,"3норма обслуживания1,2",0.86,null,{"v":2,"d":"2.0"}]
[{"$nulls":3},"нормам обслужи-вания","нормам времени обслужи-вания","нормам обслужи-вания","нормам времени обслужи-вания","нормам обслужи-вания","нормам времени обслужи-вания",null,{"$f":"CONCATENATE(Калькулятор!$G$9,Калькулятор!$AD$61,Калькулятор!$G$51)","v":"норма обслуживания"},3,"норма времени обслуживания",1.2,"3норма времени обслуживания1,2",1.16,null,2.2]
[null,null,1.2,0.83,{"v":1.2,"d":"1.20"},0.86,1.16,0.97,1.03,null,{"$f":"CONCATENATE(Калькулятор!$G$9,Калькулятор!$AD$81,Калькулятор!$G$79)","v":"норма времени обслуживания"},4,"норма обслуживания",1.2,"4норма обслуживания1,2",0.97,null,2.4]
[null,null,1.4,0.71,1.41,0.83,{"v":1.2,"d":"1.20"},0.95,1.05,null,{"$f":"CONCATENATE(Калькулятор!$G$9,Калькулятор!$AD$83,Калькулятор!$G$79)","v":"норма обслуживания"},4,"норма времени обслуживания",1.2,"4норма времени обслуживания1,2",1.03,null,2.6]
[null,null,1.6,0.62,1.61,0.67,1.49,0.93,1.08,null,{"$f":"CONCATENATE(Калькулятор!$G$9,Калькулятор!$AD$97,Калькулятор!$G$101)","v":"норма времени обслуживания"},5,"норма обслуживания",1.2,"5норма обслуживания1,2",0.97,null,2.8]
[null,null,1.8,0.55,1.82,{"v":0.6,"d":"0.60"},1.67,{"v":0.9,"d":"0.90"},1.11,null,{"$f":"CONCATENATE(Калькулятор!$G$9,Калькулятор!$AD$99,Калькулятор!$G$101)","v":"норма обслуживания"},5,"норма времени обслуживания",1.2,"5норма времени обслуживания1,2",1.03,null,{"v":3,"d":"3.0"}]
[null,null,{"v":2,"d":"2.0"},{"v":0.5,"d":"0.50"},{"v":2,"d":"2.00"},0.55,1.82,0.88,1.14,null,{"$f":"CONCATENATE(Калькулятор!$G$9,Калькулятор!$AD$111,Калькулятор!$G$117)","v":"норма времени обслуживания"},1,"норма обслуживания",1.4,"1норма обслуживания1,4",0.71]
[null,null,2.2,0.45,2.22,{"v":0.5,"d":"0.50"},{"v":2,"d":"2.00"},0.87,1.15,null,{"$f":"CONCATENATE(Калькулятор!$G$9,Калькулятор!$AD$113,Калькулятор!$G$117)","v":"норма обслуживания"},1,"норма времени обслуживания",1.4,"1норма времени обслуживания1,4",1.41,null,{"$f":"CONCATENATE(Калькулятор!$G$9,Калькулятор!$AD$129,Калькулятор!$G$135)","v":""}]
[null,null,2.4,0.41,2.44,0.46,2.17,0.85,1.18,null,{"$f":"CONCATENATE(Калькулятор!$G$11,Калькулятор!$T$129,Калькулятор!$G$135)","v":"норма времени обслуживания"},2,"норма обслуживания",1.4,"2норма обслуживания1,4",0.83,null,{"$f":"CONCATENATE(Калькулятор!$G$9,Калькулятор!$AD$130,Калькулятор!$G$135)","v":""}]
[null,null,2.6,0.38,2.63,0.43,2.32,0.84,1.19,null,{"$f":"CONCATENATE(Калькулятор!$G$11,Калькулятор!$T$130,Калькулятор!$G$135)","v":"норма обслуживания"},2,"норма времени обслуживания",1.4,"2норма времени обслуживания1,4",{"v":1.2,"d":"1.20"}]
[null,null,2.8,0.35,2.86,{"v":0.4,"d":"0.40"},{"v":2.5,"d":"2.50"},0.81,1.23,null,{"$f":"CONCATENATE(Калькулятор!$G$11,Калькулятор!$T$145,Калькулятор!$G$151)","v":"норма времени обслуживания"},3,"норма обслуживания",1.4,"3норма обслуживания1,4",0.83]
[null,null,{"v":3,"d":"3.0"},0.33,3.03,0.38,2.63,{"v":0.8,"d":"0.80"},1.25,null,{"$f":"CONCATENATE(Калькулятор!$G$11,Калькулятор!$T$146,Калькулятор!$G$151)","v":"норма обслуживания"},3,"норма времени обслуживания",1.4,"3норма времени обслуживания1,4",{"v":1.2,"d":"1.20"}]
[{"$nulls":10},{"$f":"CONCATENATE(Калькулятор!$G$11,Калькулятор!$T$161,Калькулятор!$G$167)","v":"норма времени обслуживания"},4,"норма обслуживания",1.4,"4норма обслуживания1,4",0.95]
[{"$nulls":10},{"$f":"CONCATENATE(Калькулятор!$G$11,Калькулятор!$T$162,Калькулятор!$G$167)","v":"норма обслуживания"},4,"норма времени обслуживания",1.4,"4норма времени обслуживания1,4",1.05]
[{"$nulls":10},{"$f":"CONCATENATE(Калькулятор!$G$11,Калькулятор!$T$177,Калькулятор!$G$183)","v":"норма времени обслуживания"},5,"норма обслуживания",1.4,"5норма обслуживания1,4",0.95]
[{"$nulls":10},{"$f":"CONCATENATE(Калькулятор!$G$11,Калькулятор!$T$178,Калькулятор!$G$183)","v":"норма обслуживания"},5,"норма времени обслуживания",1.4,"5норма времени обслуживания1,4",1.05]
[{"$nulls":10},{"$f":"CONCATENATE(Калькулятор!$G$11,Калькулятор!$T$193,Калькулятор!$G$199)","v":"норма времени обслуживания"},1,"норма обслуживания",1.6,"1норма обслуживания1,6",0.62]
[{"$nulls":10},{"$f":"CONCATENATE(Калькулятор!$G$11,Калькулятор!$T$194,Калькулятор!$G$199)","v":"норма обслуживания"},1,"норма времени обслуживания",1.6,"1норма времени обслуживания1,6",1.61]
[{"$nulls":10},{"$f":"CONCATENATE(Калькулятор!$G$13,Калькулятор!$T$211,Калькулятор!$G$217)","v":"норма времени обслуживания"},2,"норма обслуживания",1.6,"2норма обслуживания1,6",0.67]
[{"$nulls":10},{"$f":"CONCATENATE(Калькулятор!$G$13,Калькулятор!$T$212,Калькулятор!$G$217)","v":"норма обслуживания"},2,"норма времени обслуживания",1.6,"2норма времени обслуживания1,6",1.49]
[{"$nulls":10},{"$f":"CONCATENATE(Калькулятор!$G$13,Калькулятор!$T$227,Калькулятор!$G$233)","v":"норма времени обслуживания"},3,"норма обслуживания",1.6,"3норма обслуживания1,6",0.67]
[{"$nulls":10},{"$f":"CONCATENATE(Калькулятор!$G$13,Калькулятор!$T$228,Калькулятор!$G$233)","v":"норма обслуживания"},3,"норма времени обслуживания",1.6,"3норма времени обслуживания1,6",1.49]
[{"$nulls":10},{"$f":"CONCATENATE(Калькулятор!$G$13,Калькулятор!$T$243,Калькулятор!$G$249)","v":"норма времени обслуживания"},4,"норма обслуживания",1.6,"4норма обслуживания1,6",0.93]
[{"$nulls":10},{"$f":"CONCATENATE(Калькулятор!$G$13,Калькулятор!$T$244,Калькулятор!$G$249)","v":"норма обслуживания"},4,"норма времени обслуживания",1.6,"4норма времени обслуживания1,6",1.08]
[{"$nulls":10},{"$f":"CONCATENATE(Калькулятор!$G$13,Калькулятор!$T$259,Калькулятор!$G$265)","v":"норма времени обслуживания"},5,"норма обслуживания",1.6,"5норма обслуживания1,6",0.93]
[{"$nulls":10},{"$f":"CONCATENATE(Калькулятор!$G$13,Калькулятор!$T$260,Калькулятор!$G$265)","v":"норма обслуживания"},5,"норма времени обслуживания",1.6,"5норма времени обслуживания1,6",1.08]
[{"$nulls":10},{"$f":"CONCATENATE(Калькулятор!$G$13,Калькулятор!$T$275,Калькулятор!$G$281)","v":"норма времени обслуживания"},1,"норма обслуживания",1.8,"1норма обслуживания1,8",0.55]
[{"$nulls":10},{"$f":"CONCATENATE(Калькулятор!$G$13,Калькулятор!$T$276,Калькулятор!$G$281)","v":"норма обслуживания"},1,"норма времени обслуживания",1.8,"1норма времени обслуживания1,8",1.82]
[{"$nulls":10},{"$f":"CONCATENATE(Калькулятор!$G$13,Калькулятор!$T$291,Калькулятор!$G$297)","v":"норма времени обслуживания"},2,"норма обслуживания",1.8,"2норма обслуживания1,8",{"v":0.6,"d":"0.60"}]
[{"$nulls":10},{"$f":"CONCATENATE(Калькулятор!$G$13,Калькулятор!$T$292,Калькулятор!$G$297)","v":"норма обслуживания"},2,"норма времени обслуживания",1.8,"2норма времени обслуживания1,8",1.67]
[{"$nulls":10},{"$f":"CONCATENATE(Калькулятор!$G$13,Калькулятор!$T$307,Калькулятор!$G$313)","v":"норма времени обслуживания"},3,"норма обслуживания",1.8,"3норма обслуживания1,8",{"v":0.6,"d":"0.60"}]
[{"$nulls":10},{"$f":"CONCATENATE(Калькулятор!$G$13,Калькулятор!$T$308,Калькулятор!$G$313)","v":"норма обслуживания"},3,"норма времени обслуживания",1.8,"3норма времени обслуживания1,8",1.67]
[{"$nulls":10},{"$f":"CONCATENATE(Калькулятор!$G$13,Калькулятор!$T$323,Калькулятор!$G$329)","v":"норма времени обслуживания"},4,"норма обслуживания",1.8,"4норма обслуживания1,8",{"v":0.9,"d":"0.90"}]
[{"$nulls":10},{"$f":"CONCATENATE(Калькулятор!$G$13,Калькулятор!$T$324,Калькулятор!$G$329)","v":"норма обслуживания"},4,"норма времени обслуживания",1.8,"4норма времени обслуживания1,8",1.11]
{"$rows_left_out":62}